BDBM68636 MLS000110763::SMR000106692::[3-(3,4-dimethoxyphenyl)-1-phenyl-4-pyrazolyl]methanol::[3-(3,4-dimethoxyphenyl)-1-phenyl-pyrazol-4-yl]methanol::[3-(3,4-dimethoxyphenyl)-1-phenylpyrazol-4-yl]methanol::cid_883556
SMILES COc1ccc(cc1OC)-c1nn(cc1CO)-c1ccccc1
InChI Key InChIKey=KLUXBIKJOBTKKH-UHFFFAOYSA-N
Data  1 EC50
  Tab Delimited (TSV)   2D SDfile   Computed 3D by Vconf -m prep SDfile
Find this compound or compounds like it in BindingDB:
Activity Spreadsheet -- Enzyme Inhibition Constant Data from BindingDB
Found 1 hit for monomerid = 68636
TargetGlycogen synthase kinase-3 beta(Homo sapiens (Human))
Broad Institute
Curated by PubChem BioAssay
LigandPNGBDBM68636(MLS000110763 | SMR000106692 | [3-(3,4-dimethoxyphe...)
Affinity DataEC50: >3.00E+5nM. Assay description: Keywords: GSK3beta, dose response, kinase, inhibition, HTS Assay Overview: The glycogen synthase kinase-3 beta (GSK-3b) is a known master regulator f...
In DepthDetails PCBioAssay